[Bf-cycles] cycles compilation error on linux

INTERLICHTSPIELHAUS interlichtspielhaus at gmail.com
Tue Apr 1 19:36:26 CEST 2014


cycles/blender compilation broke a couple of days ago

linux 64bit
gcc version 4.7.2 (Ubuntu/Linaro 4.7.2-2ubuntu1)

unfortunately this all the info i get while compiling:

*Linking CXX executable ../../bin/blender*
*now run: "make install" to copy runtime files and scripts to
*[100%] Built target blender*
*Segmentation fault (core dumped)*
*make[2]: *** [intern/cycles/kernel/kernel_sm_21.cubin] Error 139*
*make[1]: *** [intern/cycles/kernel/CMakeFiles/cycles_kernel_cuda.dir/all]
Error 2*
*make: *** [all] Error 2*

do i need to update cuda version ?

-------------- next part --------------
An HTML attachment was scrubbed...
URL: http://lists.blender.org/pipermail/bf-cycles/attachments/20140401/05bdd894/attachment.htm 

More information about the Bf-cycles mailing list